Error running HRA model

Hi everybody!

Generally, I have no problem with HRA model since I start to running it. But I took up some new data and this type error arrise:

"Cannot concatenate 'str' in 'nonetype' objects".

That´s the log:

Initializing...

08/03/2018 15:10:22 root DEBUG Loading <module 'natcap.invest.habitat_risk_assessment.hra' from 'C:\INVEST~1.3_X\INVEST~1\natcap\invest\habitat_risk_assessment\hra.pyc'> in frozen environment

Arguments:

aoi_tables C:/InVEST_3.3.3_x86/HabitatRiskAssess/zee_braspor/Input/subregions/teste/subregiotest.shp

csv_uri C:\InVEST_3.3.3_x86\HabitatRiskAssess\zee_braspor\zee\Teste2\habitat_stressor_ratings

decay_eq Exponential

grid_size 100

max_rating 3

max_stress 3

risk_eq Euclidean

workspace_dir C:\InVEST_3.3.3_x86\HabitatRiskAssess\zee_braspor\workspace



08/03/2018 15:10:22 root INFO Logging will be saved to natcap.invest.habitat_risk_assessment.hra-log-2018-08-03--15_10_22.txt

08/03/2018 15:10:22 root DEBUG Loaded the model from natcap.invest.habitat_risk_assessment.hra

08/03/2018 15:10:22 root INFO Executing the loaded model

08/03/2018 15:10:22 root INFO Running InVEST version "3.3.3"

08/03/2018 15:10:22 root INFO Python architecture: ('32bit', 'WindowsPE')

08/03/2018 15:10:22 root INFO Disk space remaining for workspace: 1.21 TB

08/03/2018 15:10:22 root INFO Pointing temporary directory at the workspace at C:\InVEST_3.3.3_x86\HabitatRiskAssess\zee_braspor\workspace

08/03/2018 15:10:22 root INFO Starting natcap.invest.habitat_risk_assessment.hra

08/03/2018 15:10:22 root INFO Setting tempfile.tempdir to C:\InVEST_3.3.3_x86\HabitatRiskAssess\zee_braspor\workspace\tmp

08/03/2018 15:10:22 natcap.invest.habitat_risk.preprocessor DEBUG ['Z1', '100']

08/03/2018 15:10:22 natcap.invest.habitat_risk.preprocessor DEBUG ['Z2', '100']

08/03/2018 15:10:22 natcap.invest.habitat_risk.preprocessor DEBUG ['Z3', '100']

08/03/2018 15:10:22 natcap.invest.habitat_risk.preprocessor DEBUG ['Z4', '200']

08/03/2018 15:10:22 natcap.invest.habitat_risk.preprocessor DEBUG ['Z4E', '200']

08/03/2018 15:10:22 natcap.invest.habitat_risk.preprocessor DEBUG ['Z5', '200']

08/03/2018 15:10:22 natcap.invest.habitat_risk.preprocessor DEBUG ['Z5E', '200']

08/03/2018 15:10:22 natcap.invest.habitat_risk_assessment.hra DEBUG PATH: C:\InVEST_3.3.3_x86\HabitatRiskAssess\zee_braspor\Input\habitatresumo

08/03/2018 15:10:22 natcap.invest.habitat_risk_assessment.hra DEBUG PATH: C:\InVEST_3.3.3_x86\HabitatRiskAssess\zee_braspor\Input\Stressorguaruja

08/03/2018 15:10:22 natcap.invest.habitat_risk_assessment.hra INFO Rasterizing shapefile layers.

08/03/2018 15:10:23 osgeo.gdal ERROR [errno 1] C:\InVEST_3.3.3_x86\HabitatRiskAssess\zee_braspor\workspace\tmp\tmpm8ts9s.tif, band 1: Failed to compute statistics, no valid pixels found in sampling.

08/03/2018 15:10:23 geoprocessing_cython INFO Distance Transform Phase 1

08/03/2018 15:10:23 geoprocessing_cython INFO Distance Transform Phase 2

08/03/2018 15:10:23 osgeo.gdal ERROR [errno 1] C:\InVEST_3.3.3_x86\HabitatRiskAssess\zee_braspor\workspace\intermediate\Stressor_Rasters\Z1_buff.tif, band 1: Failed to compute statistics, no valid pixels found in sampling.

08/03/2018 15:10:23 osgeo.gdal ERROR [errno 1] C:\InVEST_3.3.3_x86\HabitatRiskAssess\zee_braspor\workspace\tmp\tmpbwkgva.tif, band 1: Failed to compute statistics, no valid pixels found in sampling.

08/03/2018 15:10:23 geoprocessing_cython INFO Distance Transform Phase 1

08/03/2018 15:10:23 geoprocessing_cython INFO Distance Transform Phase 2

08/03/2018 15:10:23 osgeo.gdal ERROR [errno 1] C:\InVEST_3.3.3_x86\HabitatRiskAssess\zee_braspor\workspace\intermediate\Stressor_Rasters\Z2_buff.tif, band 1: Failed to compute statistics, no valid pixels found in sampling.

08/03/2018 15:10:24 osgeo.gdal ERROR [errno 1] C:\InVEST_3.3.3_x86\HabitatRiskAssess\zee_braspor\workspace\tmp\tmpf_6rsm.tif, band 1: Failed to compute statistics, no valid pixels found in sampling.

08/03/2018 15:10:24 geoprocessing_cython INFO Distance Transform Phase 1

08/03/2018 15:10:24 geoprocessing_cython INFO Distance Transform Phase 2

08/03/2018 15:10:24 osgeo.gdal ERROR [errno 1] C:\InVEST_3.3.3_x86\HabitatRiskAssess\zee_braspor\workspace\intermediate\Stressor_Rasters\Z3_buff.tif, band 1: Failed to compute statistics, no valid pixels found in sampling.

08/03/2018 15:10:24 osgeo.gdal ERROR [errno 1] C:\InVEST_3.3.3_x86\HabitatRiskAssess\zee_braspor\workspace\tmp\tmp5l8oxd.tif, band 1: Failed to compute statistics, no valid pixels found in sampling.

08/03/2018 15:10:24 geoprocessing_cython INFO Distance Transform Phase 1

08/03/2018 15:10:24 geoprocessing_cython INFO Distance Transform Phase 2

08/03/2018 15:10:24 osgeo.gdal ERROR [errno 1] C:\InVEST_3.3.3_x86\HabitatRiskAssess\zee_braspor\workspace\intermediate\Stressor_Rasters\Z4_buff.tif, band 1: Failed to compute statistics, no valid pixels found in sampling.

08/03/2018 15:10:25 osgeo.gdal ERROR [errno 1] C:\InVEST_3.3.3_x86\HabitatRiskAssess\zee_braspor\workspace\tmp\tmph5epwl.tif, band 1: Failed to compute statistics, no valid pixels found in sampling.

08/03/2018 15:10:25 geoprocessing_cython INFO Distance Transform Phase 1

08/03/2018 15:10:25 geoprocessing_cython INFO Distance Transform Phase 2

08/03/2018 15:10:25 osgeo.gdal ERROR [errno 1] C:\InVEST_3.3.3_x86\HabitatRiskAssess\zee_braspor\workspace\intermediate\Stressor_Rasters\Z4E_buff.tif, band 1: Failed to compute statistics, no valid pixels found in sampling.

08/03/2018 15:10:25 osgeo.gdal ERROR [errno 1] C:\InVEST_3.3.3_x86\HabitatRiskAssess\zee_braspor\workspace\tmp\tmpkbjd4d.tif, band 1: Failed to compute statistics, no valid pixels found in sampling.

08/03/2018 15:10:25 geoprocessing_cython INFO Distance Transform Phase 1

08/03/2018 15:10:25 geoprocessing_cython INFO Distance Transform Phase 2

08/03/2018 15:10:25 osgeo.gdal ERROR [errno 1] C:\InVEST_3.3.3_x86\HabitatRiskAssess\zee_braspor\workspace\intermediate\Stressor_Rasters\Z5_buff.tif, band 1: Failed to compute statistics, no valid pixels found in sampling.

08/03/2018 15:10:25 osgeo.gdal ERROR [errno 1] C:\InVEST_3.3.3_x86\HabitatRiskAssess\zee_braspor\workspace\tmp\tmpoehqlt.tif, band 1: Failed to compute statistics, no valid pixels found in sampling.

08/03/2018 15:10:26 geoprocessing_cython INFO Distance Transform Phase 1

08/03/2018 15:10:26 geoprocessing_cython INFO Distance Transform Phase 2

08/03/2018 15:10:26 osgeo.gdal ERROR [errno 1] C:\InVEST_3.3.3_x86\HabitatRiskAssess\zee_braspor\workspace\intermediate\Stressor_Rasters\Z5E_buff.tif, band 1: Failed to compute statistics, no valid pixels found in sampling.

08/03/2018 15:10:26 natcap.invest.habitat_risk_assessment.hra DEBUG Compute Overlap is set to True, for pair ('duna', 'Z2')

08/03/2018 15:10:26 osgeo.gdal ERROR [errno 1] C:\InVEST_3.3.3_x86\HabitatRiskAssess\zee_braspor\workspace\tmp\tmpi7esjr.tif, band 1: Failed to compute statistics, no valid pixels found in sampling.

08/03/2018 15:10:26 osgeo.gdal ERROR [errno 1] C:\InVEST_3.3.3_x86\HabitatRiskAssess\zee_braspor\workspace\tmp\tmpynlhih.tif, band 1: Failed to compute statistics, no valid pixels found in sampling.

08/03/2018 15:10:26 osgeo.gdal ERROR [errno 1] C:\InVEST_3.3.3_x86\HabitatRiskAssess\zee_braspor\workspace\intermediate\Overlap_Rasters\H[duna]_S[Z2].tif, band 1: Failed to compute statistics, no valid pixels found in sampling.

08/03/2018 15:10:26 natcap.invest.habitat_risk_assessment.hra DEBUG Compute Overlap is set to True, for pair ('Restinga', 'Z5')

08/03/2018 15:10:26 osgeo.gdal ERROR [errno 1] C:\InVEST_3.3.3_x86\HabitatRiskAssess\zee_braspor\workspace\tmp\tmpizjg6u.tif, band 1: Failed to compute statistics, no valid pixels found in sampling.

08/03/2018 15:10:26 osgeo.gdal ERROR [errno 1] C:\InVEST_3.3.3_x86\HabitatRiskAssess\zee_braspor\workspace\tmp\tmp_2zd48.tif, band 1: Failed to compute statistics, no valid pixels found in sampling.

08/03/2018 15:10:26 osgeo.gdal ERROR [errno 1] C:\InVEST_3.3.3_x86\HabitatRiskAssess\zee_braspor\workspace\intermediate\Overlap_Rasters\H[Restinga]_S[Z5].tif, band 1: Failed to compute statistics, no valid pixels found in sampling.

08/03/2018 15:10:26 natcap.invest.habitat_risk_assessment.hra DEBUG Compute Overlap is set to True, for pair ('Mangue', 'Z4')

08/03/2018 15:10:26 osgeo.gdal ERROR [errno 1] C:\InVEST_3.3.3_x86\HabitatRiskAssess\zee_braspor\workspace\tmp\tmpj4n0qu.tif, band 1: Failed to compute statistics, no valid pixels found in sampling.

08/03/2018 15:10:26 osgeo.gdal ERROR [errno 1] C:\InVEST_3.3.3_x86\HabitatRiskAssess\zee_braspor\workspace\tmp\tmpoefsx8.tif, band 1: Failed to compute statistics, no valid pixels found in sampling.

08/03/2018 15:10:26 osgeo.gdal ERROR [errno 1] C:\InVEST_3.3.3_x86\HabitatRiskAssess\zee_braspor\workspace\intermediate\Overlap_Rasters\H[Mangue]_S[Z4].tif, band 1: Failed to compute statistics, no valid pixels found in sampling.

08/03/2018 15:10:26 natcap.invest.habitat_risk_assessment.hra DEBUG Compute Overlap is set to True, for pair ('Mata', 'Z5E')

08/03/2018 15:10:26 osgeo.gdal ERROR [errno 1] C:\InVEST_3.3.3_x86\HabitatRiskAssess\zee_braspor\workspace\tmp\tmpe8jvxh.tif, band 1: Failed to compute statistics, no valid pixels found in sampling.

08/03/2018 15:10:26 osgeo.gdal ERROR [errno 1] C:\InVEST_3.3.3_x86\HabitatRiskAssess\zee_braspor\workspace\tmp\tmpw7uub9.tif, band 1: Failed to compute statistics, no valid pixels found in sampling.

08/03/2018 15:10:26 osgeo.gdal ERROR [errno 1] C:\InVEST_3.3.3_x86\HabitatRiskAssess\zee_braspor\workspace\intermediate\Overlap_Rasters\H[Mata]_S[Z5E].tif, band 1: Failed to compute statistics, no valid pixels found in sampling.

08/03/2018 15:10:26 natcap.invest.habitat_risk_assessment.hra DEBUG Compute Overlap is set to True, for pair ('Restinga', 'Z4E')

08/03/2018 15:10:27 osgeo.gdal ERROR [errno 1] C:\InVEST_3.3.3_x86\HabitatRiskAssess\zee_braspor\workspace\tmp\tmprs8mml.tif, band 1: Failed to compute statistics, no valid pixels found in sampling.

08/03/2018 15:10:27 osgeo.gdal ERROR [errno 1] C:\InVEST_3.3.3_x86\HabitatRiskAssess\zee_braspor\workspace\tmp\tmpddqdwo.tif, band 1: Failed to compute statistics, no valid pixels found in sampling.

08/03/2018 15:10:27 osgeo.gdal ERROR [errno 1] C:\InVEST_3.3.3_x86\HabitatRiskAssess\zee_braspor\workspace\intermediate\Overlap_Rasters\H[Restinga]_S[Z4E].tif, band 1: Failed to compute statistics, no valid pixels found in sampling.

08/03/2018 15:10:27 natcap.invest.habitat_risk_assessment.hra DEBUG Compute Overlap is set to True, for pair ('Mangue', 'Z4E')

08/03/2018 15:10:27 osgeo.gdal ERROR [errno 1] C:\InVEST_3.3.3_x86\HabitatRiskAssess\zee_braspor\workspace\tmp\tmpwnnlte.tif, band 1: Failed to compute statistics, no valid pixels found in sampling.

08/03/2018 15:10:27 osgeo.gdal ERROR [errno 1] C:\InVEST_3.3.3_x86\HabitatRiskAssess\zee_braspor\workspace\tmp\tmpvrhduk.tif, band 1: Failed to compute statistics, no valid pixels found in sampling.

08/03/2018 15:10:27 osgeo.gdal ERROR [errno 1] C:\InVEST_3.3.3_x86\HabitatRiskAssess\zee_braspor\workspace\intermediate\Overlap_Rasters\H[Mangue]_S[Z4E].tif, band 1: Failed to compute statistics, no valid pixels found in sampling.

08/03/2018 15:10:27 natcap.invest.habitat_risk_assessment.hra DEBUG Compute Overlap is set to True, for pair ('Mangue', 'Z5E')

08/03/2018 15:10:27 osgeo.gdal ERROR [errno 1] C:\InVEST_3.3.3_x86\HabitatRiskAssess\zee_braspor\workspace\tmp\tmp5jqrmo.tif, band 1: Failed to compute statistics, no valid pixels found in sampling.

08/03/2018 15:10:27 osgeo.gdal ERROR [errno 1] C:\InVEST_3.3.3_x86\HabitatRiskAssess\zee_braspor\workspace\tmp\tmp3lhh9a.tif, band 1: Failed to compute statistics, no valid pixels found in sampling.

08/03/2018 15:10:27 osgeo.gdal ERROR [errno 1] C:\InVEST_3.3.3_x86\HabitatRiskAssess\zee_braspor\workspace\intermediate\Overlap_Rasters\H[Mangue]_S[Z5E].tif, band 1: Failed to compute statistics, no valid pixels found in sampling.

08/03/2018 15:10:27 natcap.invest.habitat_risk_assessment.hra DEBUG Compute Overlap is set to True, for pair ('duna', 'Z3')

08/03/2018 15:10:27 osgeo.gdal ERROR [errno 1] C:\InVEST_3.3.3_x86\HabitatRiskAssess\zee_braspor\workspace\tmp\tmpenvfxr.tif, band 1: Failed to compute statistics, no valid pixels found in sampling.

08/03/2018 15:10:27 osgeo.gdal ERROR [errno 1] C:\InVEST_3.3.3_x86\HabitatRiskAssess\zee_braspor\workspace\tmp\tmpyvm9gp.tif, band 1: Failed to compute statistics, no valid pixels found in sampling.

08/03/2018 15:10:27 osgeo.gdal ERROR [errno 1] C:\InVEST_3.3.3_x86\HabitatRiskAssess\zee_braspor\workspace\intermediate\Overlap_Rasters\H[duna]_S[Z3].tif, band 1: Failed to compute statistics, no valid pixels found in sampling.

08/03/2018 15:10:27 natcap.invest.habitat_risk_assessment.hra DEBUG Compute Overlap is set to True, for pair ('Restinga', 'Z5E')

08/03/2018 15:10:27 osgeo.gdal ERROR [errno 1] C:\InVEST_3.3.3_x86\HabitatRiskAssess\zee_braspor\workspace\tmp\tmpgl7_q1.tif, band 1: Failed to compute statistics, no valid pixels found in sampling.

08/03/2018 15:10:27 osgeo.gdal ERROR [errno 1] C:\InVEST_3.3.3_x86\HabitatRiskAssess\zee_braspor\workspace\tmp\tmp0olld8.tif, band 1: Failed to compute statistics, no valid pixels found in sampling.

08/03/2018 15:10:27 natcap.invest.iui._log_model WARNING an exception encountered when logging Error serializing exception: __class__. Original exception: <class 'urllib2.HTTPError'>: HTTP Error 500: Internal Server Error

08/03/2018 15:10:27 osgeo.gdal ERROR [errno 1] C:\InVEST_3.3.3_x86\HabitatRiskAssess\zee_braspor\workspace\intermediate\Overlap_Rasters\H[Restinga]_S[Z5E].tif, band 1: Failed to compute statistics, no valid pixels found in sampling.

08/03/2018 15:10:27 natcap.invest.habitat_risk_assessment.hra DEBUG Compute Overlap is set to True, for pair ('Mata', 'Z3')

08/03/2018 15:10:27 osgeo.gdal ERROR [errno 1] C:\InVEST_3.3.3_x86\HabitatRiskAssess\zee_braspor\workspace\tmp\tmpbpmecz.tif, band 1: Failed to compute statistics, no valid pixels found in sampling.

08/03/2018 15:10:27 osgeo.gdal ERROR [errno 1] C:\InVEST_3.3.3_x86\HabitatRiskAssess\zee_braspor\workspace\tmp\tmplrxtcw.tif, band 1: Failed to compute statistics, no valid pixels found in sampling.

08/03/2018 15:10:27 osgeo.gdal ERROR [errno 1] C:\InVEST_3.3.3_x86\HabitatRiskAssess\zee_braspor\workspace\intermediate\Overlap_Rasters\H[Mata]_S[Z3].tif, band 1: Failed to compute statistics, no valid pixels found in sampling.

08/03/2018 15:10:27 natcap.invest.habitat_risk_assessment.hra DEBUG Compute Overlap is set to True, for pair ('Restinga', 'Z4')

08/03/2018 15:10:28 osgeo.gdal ERROR [errno 1] C:\InVEST_3.3.3_x86\HabitatRiskAssess\zee_braspor\workspace\tmp\tmpm_3998.tif, band 1: Failed to compute statistics, no valid pixels found in sampling.

08/03/2018 15:10:28 osgeo.gdal ERROR [errno 1] C:\InVEST_3.3.3_x86\HabitatRiskAssess\zee_braspor\workspace\tmp\tmpnoizsp.tif, band 1: Failed to compute statistics, no valid pixels found in sampling.

08/03/2018 15:10:28 osgeo.gdal ERROR [errno 1] C:\InVEST_3.3.3_x86\HabitatRiskAssess\zee_braspor\workspace\intermediate\Overlap_Rasters\H[Restinga]_S[Z4].tif, band 1: Failed to compute statistics, no valid pixels found in sampling.

08/03/2018 15:10:28 natcap.invest.habitat_risk_assessment.hra DEBUG Compute Overlap is set to True, for pair ('duna', 'Z4')

08/03/2018 15:10:28 osgeo.gdal ERROR [errno 1] C:\InVEST_3.3.3_x86\HabitatRiskAssess\zee_braspor\workspace\tmp\tmpxt6gce.tif, band 1: Failed to compute statistics, no valid pixels found in sampling.

08/03/2018 15:10:28 osgeo.gdal ERROR [errno 1] C:\InVEST_3.3.3_x86\HabitatRiskAssess\zee_braspor\workspace\tmp\tmpcnhn1p.tif, band 1: Failed to compute statistics, no valid pixels found in sampling.

08/03/2018 15:10:28 osgeo.gdal ERROR [errno 1] C:\InVEST_3.3.3_x86\HabitatRiskAssess\zee_braspor\workspace\intermediate\Overlap_Rasters\H[duna]_S[Z4].tif, band 1: Failed to compute statistics, no valid pixels found in sampling.

08/03/2018 15:10:28 natcap.invest.habitat_risk_assessment.hra DEBUG Compute Overlap is set to True, for pair ('Mangue', 'Z3')

08/03/2018 15:10:28 osgeo.gdal ERROR [errno 1] C:\InVEST_3.3.3_x86\HabitatRiskAssess\zee_braspor\workspace\tmp\tmpcpsttk.tif, band 1: Failed to compute statistics, no valid pixels found in sampling.

08/03/2018 15:10:28 osgeo.gdal ERROR [errno 1] C:\InVEST_3.3.3_x86\HabitatRiskAssess\zee_braspor\workspace\tmp\tmpsrycea.tif, band 1: Failed to compute statistics, no valid pixels found in sampling.

08/03/2018 15:10:28 osgeo.gdal ERROR [errno 1] C:\InVEST_3.3.3_x86\HabitatRiskAssess\zee_braspor\workspace\intermediate\Overlap_Rasters\H[Mangue]_S[Z3].tif, band 1: Failed to compute statistics, no valid pixels found in sampling.

08/03/2018 15:10:28 natcap.invest.habitat_risk_assessment.hra DEBUG Compute Overlap is set to True, for pair ('duna', 'Z5E')

08/03/2018 15:10:28 osgeo.gdal ERROR [errno 1] C:\InVEST_3.3.3_x86\HabitatRiskAssess\zee_braspor\workspace\tmp\tmp2qeg4m.tif, band 1: Failed to compute statistics, no valid pixels found in sampling.

08/03/2018 15:10:28 osgeo.gdal ERROR [errno 1] C:\InVEST_3.3.3_x86\HabitatRiskAssess\zee_braspor\workspace\tmp\tmppzalpx.tif, band 1: Failed to compute statistics, no valid pixels found in sampling.

08/03/2018 15:10:28 osgeo.gdal ERROR [errno 1] C:\InVEST_3.3.3_x86\HabitatRiskAssess\zee_braspor\workspace\intermediate\Overlap_Rasters\H[duna]_S[Z5E].tif, band 1: Failed to compute statistics, no valid pixels found in sampling.

08/03/2018 15:10:28 natcap.invest.habitat_risk_assessment.hra DEBUG Compute Overlap is set to True, for pair ('Restinga', 'Z3')

08/03/2018 15:10:28 osgeo.gdal ERROR [errno 1] C:\InVEST_3.3.3_x86\HabitatRiskAssess\zee_braspor\workspace\tmp\tmpiodfk9.tif, band 1: Failed to compute statistics, no valid pixels found in sampling.

08/03/2018 15:10:28 osgeo.gdal ERROR [errno 1] C:\InVEST_3.3.3_x86\HabitatRiskAssess\zee_braspor\workspace\tmp\tmp3rmve_.tif, band 1: Failed to compute statistics, no valid pixels found in sampling.

08/03/2018 15:10:28 osgeo.gdal ERROR [errno 1] C:\InVEST_3.3.3_x86\HabitatRiskAssess\zee_braspor\workspace\intermediate\Overlap_Rasters\H[Restinga]_S[Z3].tif, band 1: Failed to compute statistics, no valid pixels found in sampling.

08/03/2018 15:10:28 natcap.invest.habitat_risk_assessment.hra DEBUG Compute Overlap is set to True, for pair ('duna', 'Z4E')

08/03/2018 15:10:28 osgeo.gdal ERROR [errno 1] C:\InVEST_3.3.3_x86\HabitatRiskAssess\zee_braspor\workspace\tmp\tmpdb85qo.tif, band 1: Failed to compute statistics, no valid pixels found in sampling.

08/03/2018 15:10:28 osgeo.gdal ERROR [errno 1] C:\InVEST_3.3.3_x86\HabitatRiskAssess\zee_braspor\workspace\tmp\tmprxui2a.tif, band 1: Failed to compute statistics, no valid pixels found in sampling.

08/03/2018 15:10:28 osgeo.gdal ERROR [errno 1] C:\InVEST_3.3.3_x86\HabitatRiskAssess\zee_braspor\workspace\intermediate\Overlap_Rasters\H[duna]_S[Z4E].tif, band 1: Failed to compute statistics, no valid pixels found in sampling.

08/03/2018 15:10:28 natcap.invest.habitat_risk_assessment.hra DEBUG Compute Overlap is set to True, for pair ('Mata', 'Z2')

08/03/2018 15:10:28 osgeo.gdal ERROR [errno 1] C:\InVEST_3.3.3_x86\HabitatRiskAssess\zee_braspor\workspace\tmp\tmpgdacq6.tif, band 1: Failed to compute statistics, no valid pixels found in sampling.

08/03/2018 15:10:29 osgeo.gdal ERROR [errno 1] C:\InVEST_3.3.3_x86\HabitatRiskAssess\zee_braspor\workspace\tmp\tmp8zrqps.tif, band 1: Failed to compute statistics, no valid pixels found in sampling.

08/03/2018 15:10:29 osgeo.gdal ERROR [errno 1] C:\InVEST_3.3.3_x86\HabitatRiskAssess\zee_braspor\workspace\intermediate\Overlap_Rasters\H[Mata]_S[Z2].tif, band 1: Failed to compute statistics, no valid pixels found in sampling.

08/03/2018 15:10:29 natcap.invest.habitat_risk_assessment.hra DEBUG Compute Overlap is set to True, for pair ('duna', 'Z5')

08/03/2018 15:10:29 osgeo.gdal ERROR [errno 1] C:\InVEST_3.3.3_x86\HabitatRiskAssess\zee_braspor\workspace\tmp\tmp3crygz.tif, band 1: Failed to compute statistics, no valid pixels found in sampling.

08/03/2018 15:10:29 osgeo.gdal ERROR [errno 1] C:\InVEST_3.3.3_x86\HabitatRiskAssess\zee_braspor\workspace\tmp\tmppqzr9w.tif, band 1: Failed to compute statistics, no valid pixels found in sampling.

08/03/2018 15:10:29 osgeo.gdal ERROR [errno 1] C:\InVEST_3.3.3_x86\HabitatRiskAssess\zee_braspor\workspace\intermediate\Overlap_Rasters\H[duna]_S[Z5].tif, band 1: Failed to compute statistics, no valid pixels found in sampling.

08/03/2018 15:10:29 natcap.invest.habitat_risk_assessment.hra DEBUG Compute Overlap is set to True, for pair ('Mangue', 'Z2')

08/03/2018 15:10:29 osgeo.gdal ERROR [errno 1] C:\InVEST_3.3.3_x86\HabitatRiskAssess\zee_braspor\workspace\tmp\tmpugn4nb.tif, band 1: Failed to compute statistics, no valid pixels found in sampling.

08/03/2018 15:10:29 osgeo.gdal ERROR [errno 1] C:\InVEST_3.3.3_x86\HabitatRiskAssess\zee_braspor\workspace\tmp\tmpk2if4_.tif, band 1: Failed to compute statistics, no valid pixels found in sampling.

08/03/2018 15:10:29 osgeo.gdal ERROR [errno 1] C:\InVEST_3.3.3_x86\HabitatRiskAssess\zee_braspor\workspace\intermediate\Overlap_Rasters\H[Mangue]_S[Z2].tif, band 1: Failed to compute statistics, no valid pixels found in sampling.

08/03/2018 15:10:29 natcap.invest.habitat_risk_assessment.hra DEBUG Compute Overlap is set to True, for pair ('Restinga', 'Z2')

08/03/2018 15:10:29 osgeo.gdal ERROR [errno 1] C:\InVEST_3.3.3_x86\HabitatRiskAssess\zee_braspor\workspace\tmp\tmpe8huhr.tif, band 1: Failed to compute statistics, no valid pixels found in sampling.

08/03/2018 15:10:29 osgeo.gdal ERROR [errno 1] C:\InVEST_3.3.3_x86\HabitatRiskAssess\zee_braspor\workspace\tmp\tmp5tt4rp.tif, band 1: Failed to compute statistics, no valid pixels found in sampling.

08/03/2018 15:10:29 osgeo.gdal ERROR [errno 1] C:\InVEST_3.3.3_x86\HabitatRiskAssess\zee_braspor\workspace\intermediate\Overlap_Rasters\H[Restinga]_S[Z2].tif, band 1: Failed to compute statistics, no valid pixels found in sampling.

08/03/2018 15:10:29 natcap.invest.habitat_risk_assessment.hra DEBUG Compute Overlap is set to True, for pair ('duna', 'Z1')

08/03/2018 15:10:29 osgeo.gdal ERROR [errno 1] C:\InVEST_3.3.3_x86\HabitatRiskAssess\zee_braspor\workspace\tmp\tmpr5kv4s.tif, band 1: Failed to compute statistics, no valid pixels found in sampling.

08/03/2018 15:10:29 osgeo.gdal ERROR [errno 1] C:\InVEST_3.3.3_x86\HabitatRiskAssess\zee_braspor\workspace\tmp\tmpcz8frc.tif, band 1: Failed to compute statistics, no valid pixels found in sampling.

08/03/2018 15:10:29 osgeo.gdal ERROR [errno 1] C:\InVEST_3.3.3_x86\HabitatRiskAssess\zee_braspor\workspace\intermediate\Overlap_Rasters\H[duna]_S[Z1].tif, band 1: Failed to compute statistics, no valid pixels found in sampling.

08/03/2018 15:10:29 natcap.invest.habitat_risk_assessment.hra DEBUG Compute Overlap is set to True, for pair ('Mata', 'Z5')

08/03/2018 15:10:29 osgeo.gdal ERROR [errno 1] C:\InVEST_3.3.3_x86\HabitatRiskAssess\zee_braspor\workspace\tmp\tmpbgja_g.tif, band 1: Failed to compute statistics, no valid pixels found in sampling.

08/03/2018 15:10:29 osgeo.gdal ERROR [errno 1] C:\InVEST_3.3.3_x86\HabitatRiskAssess\zee_braspor\workspace\tmp\tmplkhjqw.tif, band 1: Failed to compute statistics, no valid pixels found in sampling.

08/03/2018 15:10:29 osgeo.gdal ERROR [errno 1] C:\InVEST_3.3.3_x86\HabitatRiskAssess\zee_braspor\workspace\intermediate\Overlap_Rasters\H[Mata]_S[Z5].tif, band 1: Failed to compute statistics, no valid pixels found in sampling.

08/03/2018 15:10:29 natcap.invest.habitat_risk_assessment.hra DEBUG Compute Overlap is set to True, for pair ('Mata', 'Z1')

08/03/2018 15:10:29 osgeo.gdal ERROR [errno 1] C:\InVEST_3.3.3_x86\HabitatRiskAssess\zee_braspor\workspace\tmp\tmpk70rxb.tif, band 1: Failed to compute statistics, no valid pixels found in sampling.

08/03/2018 15:10:30 osgeo.gdal ERROR [errno 1] C:\InVEST_3.3.3_x86\HabitatRiskAssess\zee_braspor\workspace\tmp\tmppsghdl.tif, band 1: Failed to compute statistics, no valid pixels found in sampling.

08/03/2018 15:10:30 osgeo.gdal ERROR [errno 1] C:\InVEST_3.3.3_x86\HabitatRiskAssess\zee_braspor\workspace\intermediate\Overlap_Rasters\H[Mata]_S[Z1].tif, band 1: Failed to compute statistics, no valid pixels found in sampling.

08/03/2018 15:10:30 natcap.invest.habitat_risk_assessment.hra DEBUG Compute Overlap is set to True, for pair ('Mata', 'Z4E')

08/03/2018 15:10:30 osgeo.gdal ERROR [errno 1] C:\InVEST_3.3.3_x86\HabitatRiskAssess\zee_braspor\workspace\tmp\tmpzza7eh.tif, band 1: Failed to compute statistics, no valid pixels found in sampling.

08/03/2018 15:10:30 osgeo.gdal ERROR [errno 1] C:\InVEST_3.3.3_x86\HabitatRiskAssess\zee_braspor\workspace\tmp\tmpqd_a7d.tif, band 1: Failed to compute statistics, no valid pixels found in sampling.

08/03/2018 15:10:30 osgeo.gdal ERROR [errno 1] C:\InVEST_3.3.3_x86\HabitatRiskAssess\zee_braspor\workspace\intermediate\Overlap_Rasters\H[Mata]_S[Z4E].tif, band 1: Failed to compute statistics, no valid pixels found in sampling.

08/03/2018 15:10:30 natcap.invest.habitat_risk_assessment.hra DEBUG Compute Overlap is set to True, for pair ('Mangue', 'Z5')

08/03/2018 15:10:30 osgeo.gdal ERROR [errno 1] C:\InVEST_3.3.3_x86\HabitatRiskAssess\zee_braspor\workspace\tmp\tmpv5v3s2.tif, band 1: Failed to compute statistics, no valid pixels found in sampling.

08/03/2018 15:10:30 osgeo.gdal ERROR [errno 1] C:\InVEST_3.3.3_x86\HabitatRiskAssess\zee_braspor\workspace\tmp\tmpptgzzv.tif, band 1: Failed to compute statistics, no valid pixels found in sampling.

08/03/2018 15:10:30 osgeo.gdal ERROR [errno 1] C:\InVEST_3.3.3_x86\HabitatRiskAssess\zee_braspor\workspace\intermediate\Overlap_Rasters\H[Mangue]_S[Z5].tif, band 1: Failed to compute statistics, no valid pixels found in sampling.

08/03/2018 15:10:30 natcap.invest.habitat_risk_assessment.hra DEBUG Compute Overlap is set to True, for pair ('Mangue', 'Z1')

08/03/2018 15:10:30 osgeo.gdal ERROR [errno 1] C:\InVEST_3.3.3_x86\HabitatRiskAssess\zee_braspor\workspace\tmp\tmpwwbrvw.tif, band 1: Failed to compute statistics, no valid pixels found in sampling.

08/03/2018 15:10:30 osgeo.gdal ERROR [errno 1] C:\InVEST_3.3.3_x86\HabitatRiskAssess\zee_braspor\workspace\tmp\tmpwkivam.tif, band 1: Failed to compute statistics, no valid pixels found in sampling.

08/03/2018 15:10:30 osgeo.gdal ERROR [errno 1] C:\InVEST_3.3.3_x86\HabitatRiskAssess\zee_braspor\workspace\intermediate\Overlap_Rasters\H[Mangue]_S[Z1].tif, band 1: Failed to compute statistics, no valid pixels found in sampling.

08/03/2018 15:10:30 natcap.invest.habitat_risk_assessment.hra DEBUG Compute Overlap is set to True, for pair ('Mata', 'Z4')

08/03/2018 15:10:30 osgeo.gdal ERROR [errno 1] C:\InVEST_3.3.3_x86\HabitatRiskAssess\zee_braspor\workspace\tmp\tmppfi1pb.tif, band 1: Failed to compute statistics, no valid pixels found in sampling.

08/03/2018 15:10:30 osgeo.gdal ERROR [errno 1] C:\InVEST_3.3.3_x86\HabitatRiskAssess\zee_braspor\workspace\tmp\tmpdmezok.tif, band 1: Failed to compute statistics, no valid pixels found in sampling.

08/03/2018 15:10:30 osgeo.gdal ERROR [errno 1] C:\InVEST_3.3.3_x86\HabitatRiskAssess\zee_braspor\workspace\intermediate\Overlap_Rasters\H[Mata]_S[Z4].tif, band 1: Failed to compute statistics, no valid pixels found in sampling.

08/03/2018 15:10:30 natcap.invest.habitat_risk_assessment.hra DEBUG Compute Overlap is set to True, for pair ('Restinga', 'Z1')

08/03/2018 15:10:30 osgeo.gdal ERROR [errno 1] C:\InVEST_3.3.3_x86\HabitatRiskAssess\zee_braspor\workspace\tmp\tmpzyedam.tif, band 1: Failed to compute statistics, no valid pixels found in sampling.

08/03/2018 15:10:30 osgeo.gdal ERROR [errno 1] C:\InVEST_3.3.3_x86\HabitatRiskAssess\zee_braspor\workspace\tmp\tmpcjogpf.tif, band 1: Failed to compute statistics, no valid pixels found in sampling.

08/03/2018 15:10:30 osgeo.gdal ERROR [errno 1] C:\InVEST_3.3.3_x86\HabitatRiskAssess\zee_braspor\workspace\intermediate\Overlap_Rasters\H[Restinga]_S[Z1].tif, band 1: Failed to compute statistics, no valid pixels found in sampling.

08/03/2018 15:10:30 natcap.invest.habitat_risk_assessment.hra_core INFO Applying CSV criteria to rasters.

08/03/2018 15:10:30 osgeo.gdal ERROR [errno 1] C:\InVEST_3.3.3_x86\HabitatRiskAssess\zee_braspor\workspace\tmp\tmp_gtxue.tif, band 1: Failed to compute statistics, no valid pixels found in sampling.

08/03/2018 15:10:30 osgeo.gdal ERROR [errno 1] C:\InVEST_3.3.3_x86\HabitatRiskAssess\zee_braspor\workspace\intermediate\ReBurned_Crit_Rasters\H[duna]_S[Z2]_Indiv_C_Raster.tif, band 1: Failed to compute statistics, no valid pixels found in sampling.

08/03/2018 15:10:31 osgeo.gdal ERROR [errno 1] C:\InVEST_3.3.3_x86\HabitatRiskAssess\zee_braspor\workspace\tmp\tmp1v6b9k.tif, band 1: Failed to compute statistics, no valid pixels found in sampling.

08/03/2018 15:10:31 osgeo.gdal ERROR [errno 1] C:\InVEST_3.3.3_x86\HabitatRiskAssess\zee_braspor\workspace\intermediate\ReBurned_Crit_Rasters\H[Restinga]_S[Z5]_Indiv_C_Raster.tif, band 1: Failed to compute statistics, no valid pixels found in sampling.

08/03/2018 15:10:31 osgeo.gdal ERROR [errno 1] C:\InVEST_3.3.3_x86\HabitatRiskAssess\zee_braspor\workspace\tmp\tmp40tju8.tif, band 1: Failed to compute statistics, no valid pixels found in sampling.

08/03/2018 15:10:31 osgeo.gdal ERROR [errno 1] C:\InVEST_3.3.3_x86\HabitatRiskAssess\zee_braspor\workspace\intermediate\ReBurned_Crit_Rasters\H[Mangue]_S[Z4]_Indiv_C_Raster.tif, band 1: Failed to compute statistics, no valid pixels found in sampling.

08/03/2018 15:10:31 osgeo.gdal ERROR [errno 1] C:\InVEST_3.3.3_x86\HabitatRiskAssess\zee_braspor\workspace\tmp\tmpooyznf.tif, band 1: Failed to compute statistics, no valid pixels found in sampling.

08/03/2018 15:10:31 osgeo.gdal ERROR [errno 1] C:\InVEST_3.3.3_x86\HabitatRiskAssess\zee_braspor\workspace\intermediate\ReBurned_Crit_Rasters\H[Mata]_S[Z5E]_Indiv_C_Raster.tif, band 1: Failed to compute statistics, no valid pixels found in sampling.

08/03/2018 15:10:31 osgeo.gdal ERROR [errno 1] C:\InVEST_3.3.3_x86\HabitatRiskAssess\zee_braspor\workspace\tmp\tmpspizal.tif, band 1: Failed to compute statistics, no valid pixels found in sampling.

08/03/2018 15:10:31 osgeo.gdal ERROR [errno 1] C:\InVEST_3.3.3_x86\HabitatRiskAssess\zee_braspor\workspace\intermediate\ReBurned_Crit_Rasters\H[Restinga]_S[Z4E]_Indiv_C_Raster.tif, band 1: Failed to compute statistics, no valid pixels found in sampling.

08/03/2018 15:10:31 osgeo.gdal ERROR [errno 1] C:\InVEST_3.3.3_x86\HabitatRiskAssess\zee_braspor\workspace\tmp\tmpjb9mr6.tif, band 1: Failed to compute statistics, no valid pixels found in sampling.

08/03/2018 15:10:31 osgeo.gdal ERROR [errno 1] C:\InVEST_3.3.3_x86\HabitatRiskAssess\zee_braspor\workspace\intermediate\ReBurned_Crit_Rasters\H[Mangue]_S[Z4E]_Indiv_C_Raster.tif, band 1: Failed to compute statistics, no valid pixels found in sampling.

08/03/2018 15:10:31 osgeo.gdal ERROR [errno 1] C:\InVEST_3.3.3_x86\HabitatRiskAssess\zee_braspor\workspace\tmp\tmp_k2pbp.tif, band 1: Failed to compute statistics, no valid pixels found in sampling.

08/03/2018 15:10:31 osgeo.gdal ERROR [errno 1] C:\InVEST_3.3.3_x86\HabitatRiskAssess\zee_braspor\workspace\intermediate\ReBurned_Crit_Rasters\H[Mangue]_S[Z5E]_Indiv_C_Raster.tif, band 1: Failed to compute statistics, no valid pixels found in sampling.

08/03/2018 15:10:31 osgeo.gdal ERROR [errno 1] C:\InVEST_3.3.3_x86\HabitatRiskAssess\zee_braspor\workspace\tmp\tmpybpwnt.tif, band 1: Failed to compute statistics, no valid pixels found in sampling.

08/03/2018 15:10:31 osgeo.gdal ERROR [errno 1] C:\InVEST_3.3.3_x86\HabitatRiskAssess\zee_braspor\workspace\intermediate\ReBurned_Crit_Rasters\H[duna]_S[Z3]_Indiv_C_Raster.tif, band 1: Failed to compute statistics, no valid pixels found in sampling.

08/03/2018 15:10:31 osgeo.gdal ERROR [errno 1] C:\InVEST_3.3.3_x86\HabitatRiskAssess\zee_braspor\workspace\tmp\tmpyifdab.tif, band 1: Failed to compute statistics, no valid pixels found in sampling.

08/03/2018 15:10:31 osgeo.gdal ERROR [errno 1] C:\InVEST_3.3.3_x86\HabitatRiskAssess\zee_braspor\workspace\intermediate\ReBurned_Crit_Rasters\H[Restinga]_S[Z5E]_Indiv_C_Raster.tif, band 1: Failed to compute statistics, no valid pixels found in sampling.

08/03/2018 15:10:31 osgeo.gdal ERROR [errno 1] C:\InVEST_3.3.3_x86\HabitatRiskAssess\zee_braspor\workspace\tmp\tmpnza8fn.tif, band 1: Failed to compute statistics, no valid pixels found in sampling.

08/03/2018 15:10:31 osgeo.gdal ERROR [errno 1] C:\InVEST_3.3.3_x86\HabitatRiskAssess\zee_braspor\workspace\intermediate\ReBurned_Crit_Rasters\H[Mata]_S[Z3]_Indiv_C_Raster.tif, band 1: Failed to compute statistics, no valid pixels found in sampling.

08/03/2018 15:10:31 osgeo.gdal ERROR [errno 1] C:\InVEST_3.3.3_x86\HabitatRiskAssess\zee_braspor\workspace\tmp\tmphott2p.tif, band 1: Failed to compute statistics, no valid pixels found in sampling.

08/03/2018 15:10:31 osgeo.gdal ERROR [errno 1] C:\InVEST_3.3.3_x86\HabitatRiskAssess\zee_braspor\workspace\intermediate\ReBurned_Crit_Rasters\H[Restinga]_S[Z4]_Indiv_C_Raster.tif, band 1: Failed to compute statistics, no valid pixels found in sampling.

08/03/2018 15:10:32 osgeo.gdal ERROR [errno 1] C:\InVEST_3.3.3_x86\HabitatRiskAssess\zee_braspor\workspace\tmp\tmpdtynsg.tif, band 1: Failed to compute statistics, no valid pixels found in sampling.

08/03/2018 15:10:32 osgeo.gdal ERROR [errno 1] C:\InVEST_3.3.3_x86\HabitatRiskAssess\zee_braspor\workspace\intermediate\ReBurned_Crit_Rasters\H[duna]_S[Z4]_Indiv_C_Raster.tif, band 1: Failed to compute statistics, no valid pixels found in sampling.

08/03/2018 15:10:32 osgeo.gdal ERROR [errno 1] C:\InVEST_3.3.3_x86\HabitatRiskAssess\zee_braspor\workspace\tmp\tmpuuzz7t.tif, band 1: Failed to compute statistics, no valid pixels found in sampling.

08/03/2018 15:10:32 osgeo.gdal ERROR [errno 1] C:\InVEST_3.3.3_x86\HabitatRiskAssess\zee_braspor\workspace\intermediate\ReBurned_Crit_Rasters\H[Mangue]_S[Z3]_Indiv_C_Raster.tif, band 1: Failed to compute statistics, no valid pixels found in sampling.

08/03/2018 15:10:32 osgeo.gdal ERROR [errno 1] C:\InVEST_3.3.3_x86\HabitatRiskAssess\zee_braspor\workspace\tmp\tmplluaqy.tif, band 1: Failed to compute statistics, no valid pixels found in sampling.

08/03/2018 15:10:32 osgeo.gdal ERROR [errno 1] C:\InVEST_3.3.3_x86\HabitatRiskAssess\zee_braspor\workspace\intermediate\ReBurned_Crit_Rasters\H[duna]_S[Z5E]_Indiv_C_Raster.tif, band 1: Failed to compute statistics, no valid pixels found in sampling.

08/03/2018 15:10:32 osgeo.gdal ERROR [errno 1] C:\InVEST_3.3.3_x86\HabitatRiskAssess\zee_braspor\workspace\tmp\tmpbjn9gt.tif, band 1: Failed to compute statistics, no valid pixels found in sampling.

08/03/2018 15:10:32 osgeo.gdal ERROR [errno 1] C:\InVEST_3.3.3_x86\HabitatRiskAssess\zee_braspor\workspace\intermediate\ReBurned_Crit_Rasters\H[Restinga]_S[Z3]_Indiv_C_Raster.tif, band 1: Failed to compute statistics, no valid pixels found in sampling.

08/03/2018 15:10:32 osgeo.gdal ERROR [errno 1] C:\InVEST_3.3.3_x86\HabitatRiskAssess\zee_braspor\workspace\tmp\tmpyrq0sh.tif, band 1: Failed to compute statistics, no valid pixels found in sampling.

08/03/2018 15:10:32 osgeo.gdal ERROR [errno 1] C:\InVEST_3.3.3_x86\HabitatRiskAssess\zee_braspor\workspace\intermediate\ReBurned_Crit_Rasters\H[duna]_S[Z4E]_Indiv_C_Raster.tif, band 1: Failed to compute statistics, no valid pixels found in sampling.

08/03/2018 15:10:32 osgeo.gdal ERROR [errno 1] C:\InVEST_3.3.3_x86\HabitatRiskAssess\zee_braspor\workspace\tmp\tmpxrd6be.tif, band 1: Failed to compute statistics, no valid pixels found in sampling.

08/03/2018 15:10:32 osgeo.gdal ERROR [errno 1] C:\InVEST_3.3.3_x86\HabitatRiskAssess\zee_braspor\workspace\intermediate\ReBurned_Crit_Rasters\H[Mata]_S[Z2]_Indiv_C_Raster.tif, band 1: Failed to compute statistics, no valid pixels found in sampling.

08/03/2018 15:10:32 osgeo.gdal ERROR [errno 1] C:\InVEST_3.3.3_x86\HabitatRiskAssess\zee_braspor\workspace\tmp\tmpivvme5.tif, band 1: Failed to compute statistics, no valid pixels found in sampling.

08/03/2018 15:10:32 osgeo.gdal ERROR [errno 1] C:\InVEST_3.3.3_x86\HabitatRiskAssess\zee_braspor\workspace\intermediate\ReBurned_Crit_Rasters\H[duna]_S[Z5]_Indiv_C_Raster.tif, band 1: Failed to compute statistics, no valid pixels found in sampling.

08/03/2018 15:10:33 osgeo.gdal ERROR [errno 1] C:\InVEST_3.3.3_x86\HabitatRiskAssess\zee_braspor\workspace\tmp\tmpsbzedj.tif, band 1: Failed to compute statistics, no valid pixels found in sampling.

08/03/2018 15:10:33 osgeo.gdal ERROR [errno 1] C:\InVEST_3.3.3_x86\HabitatRiskAssess\zee_braspor\workspace\intermediate\ReBurned_Crit_Rasters\H[Mangue]_S[Z2]_Indiv_C_Raster.tif, band 1: Failed to compute statistics, no valid pixels found in sampling.

08/03/2018 15:10:33 osgeo.gdal ERROR [errno 1] C:\InVEST_3.3.3_x86\HabitatRiskAssess\zee_braspor\workspace\tmp\tmpwxon79.tif, band 1: Failed to compute statistics, no valid pixels found in sampling.

08/03/2018 15:10:33 osgeo.gdal ERROR [errno 1] C:\InVEST_3.3.3_x86\HabitatRiskAssess\zee_braspor\workspace\intermediate\ReBurned_Crit_Rasters\H[Restinga]_S[Z2]_Indiv_C_Raster.tif, band 1: Failed to compute statistics, no valid pixels found in sampling.

08/03/2018 15:10:33 osgeo.gdal ERROR [errno 1] C:\InVEST_3.3.3_x86\HabitatRiskAssess\zee_braspor\workspace\tmp\tmpifqbnj.tif, band 1: Failed to compute statistics, no valid pixels found in sampling.

08/03/2018 15:10:33 osgeo.gdal ERROR [errno 1] C:\InVEST_3.3.3_x86\HabitatRiskAssess\zee_braspor\workspace\intermediate\ReBurned_Crit_Rasters\H[duna]_S[Z1]_Indiv_C_Raster.tif, band 1: Failed to compute statistics, no valid pixels found in sampling.

08/03/2018 15:10:33 osgeo.gdal ERROR [errno 1] C:\InVEST_3.3.3_x86\HabitatRiskAssess\zee_braspor\workspace\tmp\tmprp1ydw.tif, band 1: Failed to compute statistics, no valid pixels found in sampling.

08/03/2018 15:10:33 osgeo.gdal ERROR [errno 1] C:\InVEST_3.3.3_x86\HabitatRiskAssess\zee_braspor\workspace\intermediate\ReBurned_Crit_Rasters\H[Mata]_S[Z5]_Indiv_C_Raster.tif, band 1: Failed to compute statistics, no valid pixels found in sampling.

08/03/2018 15:10:33 osgeo.gdal ERROR [errno 1] C:\InVEST_3.3.3_x86\HabitatRiskAssess\zee_braspor\workspace\tmp\tmpho_rwm.tif, band 1: Failed to compute statistics, no valid pixels found in sampling.

08/03/2018 15:10:33 osgeo.gdal ERROR [errno 1] C:\InVEST_3.3.3_x86\HabitatRiskAssess\zee_braspor\workspace\intermediate\ReBurned_Crit_Rasters\H[Mata]_S[Z1]_Indiv_C_Raster.tif, band 1: Failed to compute statistics, no valid pixels found in sampling.

08/03/2018 15:10:33 osgeo.gdal ERROR [errno 1] C:\InVEST_3.3.3_x86\HabitatRiskAssess\zee_braspor\workspace\tmp\tmpzcuvog.tif, band 1: Failed to compute statistics, no valid pixels found in sampling.

08/03/2018 15:10:33 osgeo.gdal ERROR [errno 1] C:\InVEST_3.3.3_x86\HabitatRiskAssess\zee_braspor\workspace\intermediate\ReBurned_Crit_Rasters\H[Mata]_S[Z4E]_Indiv_C_Raster.tif, band 1: Failed to compute statistics, no valid pixels found in sampling.

08/03/2018 15:10:33 osgeo.gdal ERROR [errno 1] C:\InVEST_3.3.3_x86\HabitatRiskAssess\zee_braspor\workspace\tmp\tmpzllhne.tif, band 1: Failed to compute statistics, no valid pixels found in sampling.

08/03/2018 15:10:33 osgeo.gdal ERROR [errno 1] C:\InVEST_3.3.3_x86\HabitatRiskAssess\zee_braspor\workspace\intermediate\ReBurned_Crit_Rasters\H[Mangue]_S[Z5]_Indiv_C_Raster.tif, band 1: Failed to compute statistics, no valid pixels found in sampling.

08/03/2018 15:10:33 osgeo.gdal ERROR [errno 1] C:\InVEST_3.3.3_x86\HabitatRiskAssess\zee_braspor\workspace\tmp\tmpav3w3u.tif, band 1: Failed to compute statistics, no valid pixels found in sampling.

08/03/2018 15:10:33 osgeo.gdal ERROR [errno 1] C:\InVEST_3.3.3_x86\HabitatRiskAssess\zee_braspor\workspace\intermediate\ReBurned_Crit_Rasters\H[Mangue]_S[Z1]_Indiv_C_Raster.tif, band 1: Failed to compute statistics, no valid pixels found in sampling.

08/03/2018 15:10:33 osgeo.gdal ERROR [errno 1] C:\InVEST_3.3.3_x86\HabitatRiskAssess\zee_braspor\workspace\tmp\tmpqx_nde.tif, band 1: Failed to compute statistics, no valid pixels found in sampling.

08/03/2018 15:10:33 osgeo.gdal ERROR [errno 1] C:\InVEST_3.3.3_x86\HabitatRiskAssess\zee_braspor\workspace\intermediate\ReBurned_Crit_Rasters\H[Mata]_S[Z4]_Indiv_C_Raster.tif, band 1: Failed to compute statistics, no valid pixels found in sampling.

08/03/2018 15:10:33 osgeo.gdal ERROR [errno 1] C:\InVEST_3.3.3_x86\HabitatRiskAssess\zee_braspor\workspace\tmp\tmpsyjt50.tif, band 1: Failed to compute statistics, no valid pixels found in sampling.

08/03/2018 15:10:33 osgeo.gdal ERROR [errno 1] C:\InVEST_3.3.3_x86\HabitatRiskAssess\zee_braspor\workspace\intermediate\ReBurned_Crit_Rasters\H[Restinga]_S[Z1]_Indiv_C_Raster.tif, band 1: Failed to compute statistics, no valid pixels found in sampling.

08/03/2018 15:10:34 osgeo.gdal ERROR [errno 1] C:\InVEST_3.3.3_x86\HabitatRiskAssess\zee_braspor\workspace\tmp\tmpyb3jbn.tif, band 1: Failed to compute statistics, no valid pixels found in sampling.

08/03/2018 15:10:34 osgeo.gdal ERROR [errno 1] C:\InVEST_3.3.3_x86\HabitatRiskAssess\zee_braspor\workspace\intermediate\ReBurned_Crit_Rasters\H[duna]_Indiv_C_Raster.tif, band 1: Failed to compute statistics, no valid pixels found in sampling.

08/03/2018 15:10:34 osgeo.gdal ERROR [errno 1] C:\InVEST_3.3.3_x86\HabitatRiskAssess\zee_braspor\workspace\tmp\tmpv9nmuo.tif, band 1: Failed to compute statistics, no valid pixels found in sampling.

08/03/2018 15:10:34 osgeo.gdal ERROR [errno 1] C:\InVEST_3.3.3_x86\HabitatRiskAssess\zee_braspor\workspace\intermediate\ReBurned_Crit_Rasters\H[duna]_Indiv_Recov_Raster.tif, band 1: Failed to compute statistics, no valid pixels found in sampling.

08/03/2018 15:10:34 osgeo.gdal ERROR [errno 1] C:\InVEST_3.3.3_x86\HabitatRiskAssess\zee_braspor\workspace\tmp\tmpywcilr.tif, band 1: Failed to compute statistics, no valid pixels found in sampling.

08/03/2018 15:10:34 osgeo.gdal ERROR [errno 1] C:\InVEST_3.3.3_x86\HabitatRiskAssess\zee_braspor\workspace\intermediate\ReBurned_Crit_Rasters\H[Mata]_Indiv_C_Raster.tif, band 1: Failed to compute statistics, no valid pixels found in sampling.

08/03/2018 15:10:34 osgeo.gdal ERROR [errno 1] C:\InVEST_3.3.3_x86\HabitatRiskAssess\zee_braspor\workspace\tmp\tmpbzqwud.tif, band 1: Failed to compute statistics, no valid pixels found in sampling.

08/03/2018 15:10:34 osgeo.gdal ERROR [errno 1] C:\InVEST_3.3.3_x86\HabitatRiskAssess\zee_braspor\workspace\intermediate\ReBurned_Crit_Rasters\H[Mata]_Indiv_Recov_Raster.tif, band 1: Failed to compute statistics, no valid pixels found in sampling.

08/03/2018 15:10:34 osgeo.gdal ERROR [errno 1] C:\InVEST_3.3.3_x86\HabitatRiskAssess\zee_braspor\workspace\tmp\tmpdwhbbr.tif, band 1: Failed to compute statistics, no valid pixels found in sampling.

08/03/2018 15:10:34 osgeo.gdal ERROR [errno 1] C:\InVEST_3.3.3_x86\HabitatRiskAssess\zee_braspor\workspace\intermediate\ReBurned_Crit_Rasters\H[Restinga]_Indiv_C_Raster.tif, band 1: Failed to compute statistics, no valid pixels found in sampling.

08/03/2018 15:10:34 osgeo.gdal ERROR [errno 1] C:\InVEST_3.3.3_x86\HabitatRiskAssess\zee_braspor\workspace\tmp\tmpwtxjuu.tif, band 1: Failed to compute statistics, no valid pixels found in sampling.

08/03/2018 15:10:34 osgeo.gdal ERROR [errno 1] C:\InVEST_3.3.3_x86\HabitatRiskAssess\zee_braspor\workspace\intermediate\ReBurned_Crit_Rasters\H[Restinga]_Indiv_Recov_Raster.tif, band 1: Failed to compute statistics, no valid pixels found in sampling.

08/03/2018 15:10:34 osgeo.gdal ERROR [errno 1] C:\InVEST_3.3.3_x86\HabitatRiskAssess\zee_braspor\workspace\tmp\tmpbziecb.tif, band 1: Failed to compute statistics, no valid pixels found in sampling.

08/03/2018 15:10:34 osgeo.gdal ERROR [errno 1] C:\InVEST_3.3.3_x86\HabitatRiskAssess\zee_braspor\workspace\intermediate\ReBurned_Crit_Rasters\H[Mangue]_Indiv_C_Raster.tif, band 1: Failed to compute statistics, no valid pixels found in sampling.

08/03/2018 15:10:34 osgeo.gdal ERROR [errno 1] C:\InVEST_3.3.3_x86\HabitatRiskAssess\zee_braspor\workspace\tmp\tmp2vrwet.tif, band 1: Failed to compute statistics, no valid pixels found in sampling.

08/03/2018 15:10:34 osgeo.gdal ERROR [errno 1] C:\InVEST_3.3.3_x86\HabitatRiskAssess\zee_braspor\workspace\intermediate\ReBurned_Crit_Rasters\H[Mangue]_Indiv_Recov_Raster.tif, band 1: Failed to compute statistics, no valid pixels found in sampling.

08/03/2018 15:10:34 osgeo.gdal ERROR [errno 1] C:\InVEST_3.3.3_x86\HabitatRiskAssess\zee_braspor\workspace\tmp\tmp_i4uia.tif, band 1: Failed to compute statistics, no valid pixels found in sampling.

08/03/2018 15:10:34 osgeo.gdal ERROR [errno 1] C:\InVEST_3.3.3_x86\HabitatRiskAssess\zee_braspor\workspace\intermediate\ReBurned_Crit_Rasters\H[duna]_S[Z2]_Indiv_E_Raster.tif, band 1: Failed to compute statistics, no valid pixels found in sampling.

08/03/2018 15:10:34 osgeo.gdal ERROR [errno 1] C:\InVEST_3.3.3_x86\HabitatRiskAssess\zee_braspor\workspace\tmp\tmpw97aly.tif, band 1: Failed to compute statistics, no valid pixels found in sampling.

08/03/2018 15:10:34 osgeo.gdal ERROR [errno 1] C:\InVEST_3.3.3_x86\HabitatRiskAssess\zee_braspor\workspace\intermediate\ReBurned_Crit_Rasters\H[Restinga]_S[Z5]_Indiv_E_Raster.tif, band 1: Failed to compute statistics, no valid pixels found in sampling.

08/03/2018 15:10:35 osgeo.gdal ERROR [errno 1] C:\InVEST_3.3.3_x86\HabitatRiskAssess\zee_braspor\workspace\tmp\tmpd89ysq.tif, band 1: Failed to compute statistics, no valid pixels found in sampling.

08/03/2018 15:10:35 osgeo.gdal ERROR [errno 1] C:\InVEST_3.3.3_x86\HabitatRiskAssess\zee_braspor\workspace\intermediate\ReBurned_Crit_Rasters\H[Mangue]_S[Z4]_Indiv_E_Raster.tif, band 1: Failed to compute statistics, no valid pixels found in sampling.

08/03/2018 15:10:35 osgeo.gdal ERROR [errno 1] C:\InVEST_3.3.3_x86\HabitatRiskAssess\zee_braspor\workspace\tmp\tmpcjbvrr.tif, band 1: Failed to compute statistics, no valid pixels found in sampling.

08/03/2018 15:10:35 osgeo.gdal ERROR [errno 1] C:\InVEST_3.3.3_x86\HabitatRiskAssess\zee_braspor\workspace\intermediate\ReBurned_Crit_Rasters\H[Mata]_S[Z5E]_Indiv_E_Raster.tif, band 1: Failed to compute statistics, no valid pixels found in sampling.

08/03/2018 15:10:35 osgeo.gdal ERROR [errno 1] C:\InVEST_3.3.3_x86\HabitatRiskAssess\zee_braspor\workspace\tmp\tmp5fmkt7.tif, band 1: Failed to compute statistics, no valid pixels found in sampling.

08/03/2018 15:10:35 osgeo.gdal ERROR [errno 1] C:\InVEST_3.3.3_x86\HabitatRiskAssess\zee_braspor\workspace\intermediate\ReBurned_Crit_Rasters\H[Restinga]_S[Z4E]_Indiv_E_Raster.tif, band 1: Failed to compute statistics, no valid pixels found in sampling.

08/03/2018 15:10:35 osgeo.gdal ERROR [errno 1] C:\InVEST_3.3.3_x86\HabitatRiskAssess\zee_braspor\workspace\tmp\tmpdwolru.tif, band 1: Failed to compute statistics, no valid pixels found in sampling.

08/03/2018 15:10:35 osgeo.gdal ERROR [errno 1] C:\InVEST_3.3.3_x86\HabitatRiskAssess\zee_braspor\workspace\intermediate\ReBurned_Crit_Rasters\H[Mangue]_S[Z4E]_Indiv_E_Raster.tif, band 1: Failed to compute statistics, no valid pixels found in sampling.

08/03/2018 15:10:35 osgeo.gdal ERROR [errno 1] C:\InVEST_3.3.3_x86\HabitatRiskAssess\zee_braspor\workspace\tmp\tmpye7vcj.tif, band 1: Failed to compute statistics, no valid pixels found in sampling.

08/03/2018 15:10:35 osgeo.gdal ERROR [errno 1] C:\InVEST_3.3.3_x86\HabitatRiskAssess\zee_braspor\workspace\intermediate\ReBurned_Crit_Rasters\H[Mangue]_S[Z5E]_Indiv_E_Raster.tif, band 1: Failed to compute statistics, no valid pixels found in sampling.

08/03/2018 15:10:35 osgeo.gdal ERROR [errno 1] C:\InVEST_3.3.3_x86\HabitatRiskAssess\zee_braspor\workspace\tmp\tmpz7ychj.tif, band 1: Failed to compute statistics, no valid pixels found in sampling.

08/03/2018 15:10:35 osgeo.gdal ERROR [errno 1] C:\InVEST_3.3.3_x86\HabitatRiskAssess\zee_braspor\workspace\intermediate\ReBurned_Crit_Rasters\H[duna]_S[Z3]_Indiv_E_Raster.tif, band 1: Failed to compute statistics, no valid pixels found in sampling.

08/03/2018 15:10:35 osgeo.gdal ERROR [errno 1] C:\InVEST_3.3.3_x86\HabitatRiskAssess\zee_braspor\workspace\tmp\tmpnjkanq.tif, band 1: Failed to compute statistics, no valid pixels found in sampling.

08/03/2018 15:10:35 osgeo.gdal ERROR [errno 1] C:\InVEST_3.3.3_x86\HabitatRiskAssess\zee_braspor\workspace\intermediate\ReBurned_Crit_Rasters\H[Restinga]_S[Z5E]_Indiv_E_Raster.tif, band 1: Failed to compute statistics, no valid pixels found in sampling.

08/03/2018 15:10:35 osgeo.gdal ERROR [errno 1] C:\InVEST_3.3.3_x86\HabitatRiskAssess\zee_braspor\workspace\tmp\tmpldfkoy.tif, band 1: Failed to compute statistics, no valid pixels found in sampling.

08/03/2018 15:10:35 osgeo.gdal ERROR [errno 1] C:\InVEST_3.3.3_x86\HabitatRiskAssess\zee_braspor\workspace\intermediate\ReBurned_Crit_Rasters\H[Mata]_S[Z3]_Indiv_E_Raster.tif, band 1: Failed to compute statistics, no valid pixels found in sampling.

08/03/2018 15:10:35 osgeo.gdal ERROR [errno 1] C:\InVEST_3.3.3_x86\HabitatRiskAssess\zee_braspor\workspace\tmp\tmpk0oquu.tif, band 1: Failed to compute statistics, no valid pixels found in sampling.

08/03/2018 15:10:35 osgeo.gdal ERROR [errno 1] C:\InVEST_3.3.3_x86\HabitatRiskAssess\zee_braspor\workspace\intermediate\ReBurned_Crit_Rasters\H[Restinga]_S[Z4]_Indiv_E_Raster.tif, band 1: Failed to compute statistics, no valid pixels found in sampling.

08/03/2018 15:10:36 osgeo.gdal ERROR [errno 1] C:\InVEST_3.3.3_x86\HabitatRiskAssess\zee_braspor\workspace\tmp\tmpoqqflx.tif, band 1: Failed to compute statistics, no valid pixels found in sampling.

08/03/2018 15:10:36 osgeo.gdal ERROR [errno 1] C:\InVEST_3.3.3_x86\HabitatRiskAssess\zee_braspor\workspace\intermediate\ReBurned_Crit_Rasters\H[duna]_S[Z4]_Indiv_E_Raster.tif, band 1: Failed to compute statistics, no valid pixels found in sampling.

08/03/2018 15:10:36 osgeo.gdal ERROR [errno 1] C:\InVEST_3.3.3_x86\HabitatRiskAssess\zee_braspor\workspace\tmp\tmp1xscbx.tif, band 1: Failed to compute statistics, no valid pixels found in sampling.

08/03/2018 15:10:36 osgeo.gdal ERROR [errno 1] C:\InVEST_3.3.3_x86\HabitatRiskAssess\zee_braspor\workspace\intermediate\ReBurned_Crit_Rasters\H[Mangue]_S[Z3]_Indiv_E_Raster.tif, band 1: Failed to compute statistics, no valid pixels found in sampling.

08/03/2018 15:10:36 osgeo.gdal ERROR [errno 1] C:\InVEST_3.3.3_x86\HabitatRiskAssess\zee_braspor\workspace\tmp\tmp4wxzup.tif, band 1: Failed to compute statistics, no valid pixels found in sampling.

08/03/2018 15:10:36 osgeo.gdal ERROR [errno 1] C:\InVEST_3.3.3_x86\HabitatRiskAssess\zee_braspor\workspace\intermediate\ReBurned_Crit_Rasters\H[duna]_S[Z5E]_Indiv_E_Raster.tif, band 1: Failed to compute statistics, no valid pixels found in sampling.

08/03/2018 15:10:36 osgeo.gdal ERROR [errno 1] C:\InVEST_3.3.3_x86\HabitatRiskAssess\zee_braspor\workspace\tmp\tmpzr8pcr.tif, band 1: Failed to compute statistics, no valid pixels found in sampling.

08/03/2018 15:10:36 osgeo.gdal ERROR [errno 1] C:\InVEST_3.3.3_x86\HabitatRiskAssess\zee_braspor\workspace\intermediate\ReBurned_Crit_Rasters\H[Restinga]_S[Z3]_Indiv_E_Raster.tif, band 1: Failed to compute statistics, no valid pixels found in sampling.

08/03/2018 15:10:36 osgeo.gdal ERROR [errno 1] C:\InVEST_3.3.3_x86\HabitatRiskAssess\zee_braspor\workspace\tmp\tmpzxatia.tif, band 1: Failed to compute statistics, no valid pixels found in sampling.

08/03/2018 15:10:36 osgeo.gdal ERROR [errno 1] C:\InVEST_3.3.3_x86\HabitatRiskAssess\zee_braspor\workspace\intermediate\ReBurned_Crit_Rasters\H[duna]_S[Z4E]_Indiv_E_Raster.tif, band 1: Failed to compute statistics, no valid pixels found in sampling.

08/03/2018 15:10:36 osgeo.gdal ERROR [errno 1] C:\InVEST_3.3.3_x86\HabitatRiskAssess\zee_braspor\workspace\tmp\tmpkz2uvp.tif, band 1: Failed to compute statistics, no valid pixels found in sampling.

08/03/2018 15:10:36 osgeo.gdal ERROR [errno 1] C:\InVEST_3.3.3_x86\HabitatRiskAssess\zee_braspor\workspace\intermediate\ReBurned_Crit_Rasters\H[Mata]_S[Z2]_Indiv_E_Raster.tif, band 1: Failed to compute statistics, no valid pixels found in sampling.

08/03/2018 15:10:36 osgeo.gdal ERROR [errno 1] C:\InVEST_3.3.3_x86\HabitatRiskAssess\zee_braspor\workspace\tmp\tmplsvsid.tif, band 1: Failed to compute statistics, no valid pixels found in sampling.

08/03/2018 15:10:36 osgeo.gdal ERROR [errno 1] C:\InVEST_3.3.3_x86\HabitatRiskAssess\zee_braspor\workspace\intermediate\ReBurned_Crit_Rasters\H[duna]_S[Z5]_Indiv_E_Raster.tif, band 1: Failed to compute statistics, no valid pixels found in sampling.

08/03/2018 15:10:36 osgeo.gdal ERROR [errno 1] C:\InVEST_3.3.3_x86\HabitatRiskAssess\zee_braspor\workspace\tmp\tmp7y0pft.tif, band 1: Failed to compute statistics, no valid pixels found in sampling.

08/03/2018 15:10:36 osgeo.gdal ERROR [errno 1] C:\InVEST_3.3.3_x86\HabitatRiskAssess\zee_braspor\workspace\intermediate\ReBurned_Crit_Rasters\H[Mangue]_S[Z2]_Indiv_E_Raster.tif, band 1: Failed to compute statistics, no valid pixels found in sampling.

08/03/2018 15:10:36 osgeo.gdal ERROR [errno 1] C:\InVEST_3.3.3_x86\HabitatRiskAssess\zee_braspor\workspace\tmp\tmp4myoul.tif, band 1: Failed to compute statistics, no valid pixels found in sampling.

08/03/2018 15:10:36 osgeo.gdal ERROR [errno 1] C:\InVEST_3.3.3_x86\HabitatRiskAssess\zee_braspor\workspace\intermediate\ReBurned_Crit_Rasters\H[Restinga]_S[Z2]_Indiv_E_Raster.tif, band 1: Failed to compute statistics, no valid pixels found in sampling.

08/03/2018 15:10:36 osgeo.gdal ERROR [errno 1] C:\InVEST_3.3.3_x86\HabitatRiskAssess\zee_braspor\workspace\tmp\tmp3qaqjj.tif, band 1: Failed to compute statistics, no valid pixels found in sampling.

08/03/2018 15:10:36 osgeo.gdal ERROR [errno 1] C:\InVEST_3.3.3_x86\HabitatRiskAssess\zee_braspor\workspace\intermediate\ReBurned_Crit_Rasters\H[duna]_S[Z1]_Indiv_E_Raster.tif, band 1: Failed to compute statistics, no valid pixels found in sampling.

08/03/2018 15:10:37 osgeo.gdal ERROR [errno 1] C:\InVEST_3.3.3_x86\HabitatRiskAssess\zee_braspor\workspace\tmp\tmpc3fglz.tif, band 1: Failed to compute statistics, no valid pixels found in sampling.

08/03/2018 15:10:37 osgeo.gdal ERROR [errno 1] C:\InVEST_3.3.3_x86\HabitatRiskAssess\zee_braspor\workspace\intermediate\ReBurned_Crit_Rasters\H[Mata]_S[Z5]_Indiv_E_Raster.tif, band 1: Failed to compute statistics, no valid pixels f

Comments

  • jdouglassjdouglass Administrator, NatCap Staff
    Hello!
    The specific error looks like it might be caused by a case where your AOI doesn't have a name.  Is that possible?

    If not, could you try running HRA on the latest version of InVEST (InVEST 3.4.4 is available for download here: https://www.naturalcapitalproject.org/invest/) and see if we happened to have already fixed the issue?

    If that doesn't do it, could you send your inputs and logfile to jdouglass@stanford.edu so we can take a look?  Thanks!
    James
  • Thank you, James!

    I made a new subregions map, and download the latest version. But now, I have troubles with this new version. First, windows doesn´t find the program to open it. And an error message occur at the pre processor step:

    This is the log:

    Initializing...

    Showing messages with level INFO and higher

    08/10/2018 14:44:00 natcap.invest.utils INFO Writing log messages to C:\Users\Daniel\Documents\hra_preprocessor_workspace\InVEST-Habitat-Risk-Assessment-Preprocessor-log-2018-08-10--14_44_00.txt

    08/10/2018 14:44:00 natcap.invest.ui.model Level 100 Starting model with parameters:

    Arguments for InVEST natcap.invest.habitat_risk_assessment.hra_preprocessor 3.4.4:

    criteria_dir

    exposure_crits [u'Temporal Overlap Rating\n', u'Management Effectiveness\n', u'Intensity Rating']

    habitats_dir C:/Users/Daniel/Desktop/Nat/HabitatRiskAssess/zee_braspor/Input/habitatresumo

    resilience_crits [u'Recovery Time']

    results_suffix

    sensitivity_crits [u'Frequency of Disturbance']

    stressors_dir C:\Users\Daniel\Desktop\Nat\HabitatRiskAssess\zee_braspor\Input\Stressorguaruja

    workspace_dir C:\Users\Daniel\Documents\hra_preprocessor_workspace


    08/10/2018 14:44:00 natcap.invest.ui.usage ERROR Error when transforming coordinates: local variable 'spatial_ref' referenced before assignment

    Traceback (most recent call last):

    File "c:\users\natcap-servers\jenkins-home\workspace\natcap.invest\label\gce-windows-1\release_env\lib\site-packages\natcap\invest\ui\usage.py", line 176, in _merge_local_bounding_boxes

    UnboundLocalError: local variable 'spatial_ref' referenced before assignment

    08/10/2018 14:44:00 natcap.invest.ui.usage ERROR Error when transforming coordinates: local variable 'spatial_ref' referenced before assignment

    Traceback (most recent call last):

    File "c:\users\natcap-servers\jenkins-home\workspace\natcap.invest\label\gce-windows-1\release_env\lib\site-packages\natcap\invest\ui\usage.py", line 176, in _merge_local_bounding_boxes

    UnboundLocalError: local variable 'spatial_ref' referenced before assignment

    08/10/2018 14:44:00 natcap.invest.ui.usage ERROR Error when transforming coordinates: local variable 'spatial_ref' referenced before assignment

    Traceback (most recent call last):

    File "c:\users\natcap-servers\jenkins-home\workspace\natcap.invest\label\gce-windows-1\release_env\lib\site-packages\natcap\invest\ui\usage.py", line 176, in _merge_local_bounding_boxes

    UnboundLocalError: local variable 'spatial_ref' referenced before assignment

    08/10/2018 14:44:00 natcap.invest.ui.usage ERROR Error when transforming coordinates: local variable 'spatial_ref' referenced before assignment

    Traceback (most recent call last):

    File "c:\users\natcap-servers\jenkins-home\workspace\natcap.invest\label\gce-windows-1\release_env\lib\site-packages\natcap\invest\ui\usage.py", line 176, in _merge_local_bounding_boxes

    UnboundLocalError: local variable 'spatial_ref' referenced before assignment

    08/10/2018 14:44:00 natcap.invest.ui.usage ERROR Error when transforming coordinates: local variable 'spatial_ref' referenced before assignment

    Traceback (most recent call last):

    File "c:\users\natcap-servers\jenkins-home\workspace\natcap.invest\label\gce-windows-1\release_env\lib\site-packages\natcap\invest\ui\usage.py", line 176, in _merge_local_bounding_boxes

    UnboundLocalError: local variable 'spatial_ref' referenced before assignment

    08/10/2018 14:44:00 natcap.invest.ui.usage ERROR Error when transforming coordinates: local variable 'spatial_ref' referenced before assignment

    Traceback (most recent call last):

    File "c:\users\natcap-servers\jenkins-home\workspace\natcap.invest\label\gce-windows-1\release_env\lib\site-packages\natcap\invest\ui\usage.py", line 176, in _merge_local_bounding_boxes

    UnboundLocalError: local variable 'spatial_ref' referenced before assignment

    08/10/2018 14:44:00 natcap.invest.ui.usage ERROR Error when transforming coordinates: local variable 'spatial_ref' referenced before assignment

    Traceback (most recent call last):

    File "c:\users\natcap-servers\jenkins-home\workspace\natcap.invest\label\gce-windows-1\release_env\lib\site-packages\natcap\invest\ui\usage.py", line 176, in _merge_local_bounding_boxes

    UnboundLocalError: local variable 'spatial_ref' referenced before assignment

    08/10/2018 14:44:00 natcap.invest.ui.usage ERROR Error when transforming coordinates: local variable 'spatial_ref' referenced before assignment

    Traceback (most recent call last):

    File "c:\users\natcap-servers\jenkins-home\workspace\natcap.invest\label\gce-windows-1\release_env\lib\site-packages\natcap\invest\ui\usage.py", line 176, in _merge_local_bounding_boxes

    UnboundLocalError: local variable 'spatial_ref' referenced before assignment

    08/10/2018 14:44:00 natcap.invest.ui.model ERROR Exception while executing <function execute at 0x1627E830>

    Traceback (most recent call last):

    File "c:\users\natcap-servers\jenkins-home\workspace\natcap.invest\label\gce-windows-1\release_env\lib\site-packages\natcap\invest\ui\model.py", line 1505, in _logged_target

    File "c:\users\natcap-servers\jenkins-home\workspace\natcap.invest\label\gce-windows-1\release_env\lib\site-packages\natcap\invest\habitat_risk_assessment\hra_preprocessor.py", line 232, in execute

    File "c:\users\natcap-servers\jenkins-home\workspace\natcap.invest\label\gce-windows-1\release_env\lib\site-packages\natcap\invest\habitat_risk_assessment\hra_preprocessor.py", line 414, in make_crit_shape_dict

    IOError: Using spatically explicit critiera requires you to have subfolders named "Resilience", "Exposure", and "Sensitivity". Check that all these folders exist, and that your criteria are placed properly.

    08/10/2018 14:44:00 natcap.invest.ui.model INFO Execution finished

    08/10/2018 14:44:00 natcap.invest.utils INFO Elapsed time: 0.06s

    08/10/2018 14:44:00 natcap.invest.ui.execution ERROR Target <function _logged_target at 0x165C35B0> failed with exception

    Traceback (most recent call last):

    File "c:\users\natcap-servers\jenkins-home\workspace\natcap.invest\label\gce-windows-1\release_env\lib\site-packages\natcap\invest\ui\execution.py", line 68, in run

    File "c:\users\natcap-servers\jenkins-home\workspace\natcap.invest\label\gce-windows-1\release_env\lib\site-packages\natcap\invest\ui\model.py", line 1505, in _logged_target

    File "c:\users\natcap-servers\jenkins-home\workspace\natcap.invest\label\gce-windows-1\release_env\lib\site-packages\natcap\invest\habitat_risk_assessment\hra_preprocessor.py", line 232, in execute

    File "c:\users\natcap-servers\jenkins-home\workspace\natcap.invest\label\gce-windows-1\release_env\lib\site-packages\natcap\invest\habitat_risk_assessment\hra_preprocessor.py", line 414, in make_crit_shape_dict

    IOError: Using spatically explicit critiera requires you to have subfolders named "Resilience", "Exposure", and "Sensitivity". Check that all these folders exist, and that your criteria are placed properly.

    08/10/2018 14:44:00 natcap.invest.ui.execution INFO Execution finished


    I put the same criterias that I´ve used ate invest 3.3.3.


  • Hi again!

    I get back to invest 3.3.3 and now have another error:

     list index out of range


    Initializing...

    08/13/2018 14:26:02 root DEBUG Loading <module 'natcap.invest.habitat_risk_assessment.hra' from 'C:\INVEST~1.3_X\INVEST~1\natcap\invest\habitat_risk_assessment\hra.pyc'> in frozen environment

    Arguments:

    aoi_tables C:/subregions/ilhastoamaro.shp

    csv_uri C:\InVEST_3.3.3_x86\HabitatRiskAssess\Preprocesso\habitat_stressor_ratings

    decay_eq Exponential

    grid_size 50

    max_rating 3

    max_stress 3

    risk_eq Euclidean

    workspace_dir C:\InVEST_3.3.3_x86\HabitatRiskAssess\Workspace



    08/13/2018 14:26:02 root INFO Logging will be saved to natcap.invest.habitat_risk_assessment.hra-log-2018-08-13--14_26_02.txt

    08/13/2018 14:26:02 root DEBUG Loaded the model from natcap.invest.habitat_risk_assessment.hra

    08/13/2018 14:26:02 root INFO Executing the loaded model

    08/13/2018 14:26:02 root INFO Running InVEST version "3.3.3"

    08/13/2018 14:26:02 root INFO Python architecture: ('32bit', 'WindowsPE')

    08/13/2018 14:26:02 root INFO Disk space remaining for workspace: 798.01 GB

    08/13/2018 14:26:02 root INFO Pointing temporary directory at the workspace at C:\InVEST_3.3.3_x86\HabitatRiskAssess\Workspace

    08/13/2018 14:26:02 root INFO Starting natcap.invest.habitat_risk_assessment.hra

    08/13/2018 14:26:02 root INFO Setting tempfile.tempdir to C:\InVEST_3.3.3_x86\HabitatRiskAssess\Workspace\tmp

    08/13/2018 14:26:02 natcap.invest.iui._log_model WARNING an exception encountered when logging 'utf8' codec can't decode byte 0xe1 in position 3: invalid continuation byte

    08/13/2018 14:26:02 natcap.invest.habitat_risk.preprocessor DEBUG ['Z1', '100']

    08/13/2018 14:26:02 natcap.invest.habitat_risk.preprocessor DEBUG ['Z2', '100']

    08/13/2018 14:26:02 natcap.invest.habitat_risk.preprocessor DEBUG ['Z3', '100']

    08/13/2018 14:26:02 natcap.invest.habitat_risk.preprocessor DEBUG ['Z4', '200']

    08/13/2018 14:26:02 natcap.invest.habitat_risk.preprocessor DEBUG ['Z4E', '200']

    08/13/2018 14:26:02 natcap.invest.habitat_risk.preprocessor DEBUG ['Z5', '200']

    08/13/2018 14:26:02 natcap.invest.habitat_risk.preprocessor DEBUG ['Z5E', '200']

    08/13/2018 14:26:02 root ERROR ---------------------------------------------------

    08/13/2018 14:26:02 root ERROR ---------------------- ERROR ----------------------

    08/13/2018 14:26:02 root ERROR ---------------------------------------------------

    08/13/2018 14:26:02 root ERROR Error: exception found while running natcap.invest.habitat_risk_assessment.hra

    08/13/2018 14:26:02 root DEBUG

    08/13/2018 14:26:02 root DEBUG Build details

    08/13/2018 14:26:02 root DEBUG Interpreter

    08/13/2018 14:26:02 root DEBUG Current temp dir: C:\InVEST_3.3.3_x86\HabitatRiskAssess\Workspace\tmp

    08/13/2018 14:26:02 root DEBUG tempfile.tempdir: C:\InVEST_3.3.3_x86\HabitatRiskAssess\Workspace\tmp

    08/13/2018 14:26:02 root DEBUG

    08/13/2018 14:26:02 root DEBUG System

    08/13/2018 14:26:02 root DEBUG OS : Windows-8-6.2.9200

    08/13/2018 14:26:02 root DEBUG Processor architecture: AMD64

    08/13/2018 14:26:02 root DEBUG FS encoding : mbcs

    08/13/2018 14:26:02 root DEBUG Preferred encoding: cp1252

    08/13/2018 14:26:02 root DEBUG

    08/13/2018 14:26:02 root DEBUG Python

    08/13/2018 14:26:02 root DEBUG Version : 2.7.9

    08/13/2018 14:26:02 root DEBUG Build : ('default', 'Dec 10 2014 12:24:55')

    08/13/2018 14:26:02 root DEBUG Compiler : MSC v.1500 32 bit (Intel)

    08/13/2018 14:26:02 root DEBUG Implementation : CPython

    08/13/2018 14:26:02 root DEBUG Architecture : 32bit

    08/13/2018 14:26:02 root DEBUG Linkage format : WindowsPE

    08/13/2018 14:26:02 root DEBUG

    08/13/2018 14:26:02 root DEBUG Packages

    08/13/2018 14:26:02 root DEBUG Cython : ?

    08/13/2018 14:26:02 root DEBUG Numpy : 1.11.2

    08/13/2018 14:26:02 root DEBUG Scipy : 0.16.1

    08/13/2018 14:26:02 root DEBUG OSGEO : 1.11.3

    08/13/2018 14:26:02 root DEBUG Shapely : 1.5.5

    08/13/2018 14:26:02 root DEBUG InVEST : 3.3.3

    08/13/2018 14:26:02 root DEBUG

    08/13/2018 14:26:02 root DEBUG

    08/13/2018 14:26:02 root DEBUG Exception not environment-related

    08/13/2018 14:26:02 root DEBUG Printing traceback

    Traceback (most recent call last):

    File "C:\Users\natcap-servers\jenkins-home\workspace\natcap.invest\label\GCE-windows-1\exe\build\invest\out00-PYZ.pyz\natcap.invest.iui.executor", line 620, in runModel

    File "C:\Users\natcap-servers\jenkins-home\workspace\natcap.invest\label\GCE-windows-1\exe\build\invest\out00-PYZ.pyz\natcap.invest.habitat_risk_assessment.hra", line 266, in execute

    File "C:\Users\natcap-servers\jenkins-home\workspace\natcap.invest\label\GCE-windows-1\exe\build\invest\out00-PYZ.pyz\natcap.invest.habitat_risk_assessment.hra", line 1265, in unpack_over_dict

    File "C:\Users\natcap-servers\jenkins-home\workspace\natcap.invest\label\GCE-windows-1\exe\build\invest\out00-PYZ.pyz\natcap.invest.habitat_risk_assessment.hra_preprocessor", line 595, in parse_hra_tables

    File "C:\Users\natcap-servers\jenkins-home\workspace\natcap.invest\label\GCE-windows-1\exe\build\invest\out00-PYZ.pyz\natcap.invest.habitat_risk_assessment.hra_preprocessor", line 854, in parse_overlaps

    IndexError: list index out of range













































































    08/13/2018 14:26:02 root ERROR Exiting due to failures


    Can you help me, please?

Sign In or Register to comment.